BDBM50130143 (R)-1-[(2R,5R,2'R,5'R)-5'-((R)-1-hydroxy-hexyl)-octahydro-[2,2']bifuranyl-5-yl]-hexan-1-ol::(R)-1-[(2R,5R,4'R)-5'-((1R,2R)-1-Hydroxy-hexyl)-octahydro-[2,2']bifuranyl-5-yl]-hexan-1-ol::CHEMBL80354
SMILES CCCCC[C@@H](O)[C@H]1CC[C@@H](O1)[C@H]1CC[C@@H](O1)[C@H](O)CCCCC
InChI Key InChIKey=XZNKTKFFQRIQAN-BZIXAJQCSA-N
Data  2 IC50
  Tab Delimited (TSV)   2D SDfile   Computed 3D by Vconf -m prep SDfile
Find this compound or compounds like it in BindingDB:
Activity Spreadsheet -- Enzyme Inhibition Constant Data from BindingDB
Found 1 hit for monomerid = 50130143
TargetAcyl carrier protein, mitochondrial(Bos taurus)
Kyoto University
Curated by ChEMBL
LigandPNGBDBM50130143((R)-1-[(2R,5R,2'R,5'R)-5'-((R)-1-hydroxy-hexyl)-oc...)
Affinity DataIC50:  4.50E+3nM. Assay description: Inhibition of bovine mitochondrial NADH-ubiquinone oxidoreductase by NADH oxidase assay
In DepthDetails ArticlePubMed